{"text_format":"1","workbook":"xlsx","n_sheets":15,"sheets":["Datos (GENERALES)","Datos (SUP AISLADA)","Datos (ESP AISLAMIENTO)","Datos (PPI AISLAMIENTO)","CALIFICACIÓN","COSTE NO AISLAM","Datos (GENERALES) (IMP)","Datos (SUP AISLADA) (IMP)","Datos (ESP AISLAMIENTO) (IMP)","Datos (PPI AISLAMIENTO) (IMP)","CALIFICACIÓN (IMP)","COSTE NO AISLAM (IMP)","RECOMENDACIONES (IMP)","Hoja de programación","Hoja Cálculos Térmicos"],"not_rendered":{"charts":0,"images":1,"macros":1,"external_links":0,"defined_names":67,"comments":0,"pivot_tables":0},"unopened":[],"bounds":{"document_bytes":16777216,"sheet_cells":100000,"rows_first":2000,"rows_last":500,"rows_between":2000,"halvings":0,"cell_chars":16384,"cell_head_chars":4096},"cells_cut":0,"cells_raw":0,"read":"whole","date_system":"1900"}

{"sheet":"Datos (GENERALES)","index":0,"n_rows":111,"n_cols":7,"rows_kept":111,"cut":false,"hidden":false,"merged":[]}
[]
[null,"CÓDIGO DE INSPECCIÓN"]
["HERRAMIENTA DE PREDIAGNÓSTICO DE ESTADO DE AISLAMIENTO DE SUPERFICIES CALIENTES EN INSTALACIONES INDUSTRIALES"]
[]
["DATOS GENERALES"]
[]
["PROPIEDAD DE LA INSTALACIÓN"]
[]
{"$rows_left_out":104}
{"sheet":"Datos (SUP AISLADA)","index":1,"n_rows":33,"n_cols":13,"rows_kept":33,"cut":false,"hidden":false,"merged":[]}
["ANEXO 1: SUPERFICIE AISLADA"]
[]
["A) Superficies de tuberías (hasta 1000 mm de diámetro)"]
[]
["Tª superficial de la instalación\n(ºC)","Total m² tubería","Total m² aislados para Conservación de Calor\n(CC)","Total m² aislados para Protección Personal\n(PP)",null,"% de superficie aislada para Conservación de Calor\n(CC)","% de superficie aislada para protección personal (PP)","% de superficie aislada (CC+PP)","% de superficie sin aislamiento",null,"Temperatura media de cada tramo (ºC)","TI\nTemperatura Incremental media para cálculo de CISA\nT(ºC)-60ºC","CISA60 (m²xTI)/1000"]
["60<X≤100",null,null,null,null,{"$f":"IF(B6<>0,C6/B6,0)","v":0},{"$f":"IF(B6<>0,D6/B6,0)","v":0},{"$f":"F6+G6","v":0},{"$f":"IF(B6<>0,1-F6-G6,0)","v":0},null,80,{"$f":"K6-60","v":20},{"$f":"ROUND(L6*B6/1000,0)","v":0}]
["100<X≤200",null,null,null,null,{"$f":"IF(B7<>0,C7/B7,0)","v":0},{"$f":"IF(B7<>0,D7/B7,0)","v":0},{"$f":"F7+G7","v":0},{"$f":"IF(B7<>0,1-F7-G7,0)","v":0},null,150,{"$f":"K7-60","v":90},{"$f":"ROUND(L7*B7/1000,0)","v":0}]
["200<X≤300",null,null,null,null,{"$f":"IF(B8<>0,C8/B8,0)","v":0},{"$f":"IF(B8<>0,D8/B8,0)","v":0},0,0,null,250,190,0]
{"$rows_left_out":26}
{"sheet":"Datos (ESP AISLAMIENTO)","index":2,"n_rows":123,"n_cols":5,"rows_kept":123,"cut":false,"hidden":false,"merged":[]}
[null,"ANEXO 2: ESPESORES DE AISLAMIENTO"]
[]
[null,"A) Superficies de tuberías (hasta 1000 mm de diámetro)"]
[]
[null,"A.1) Superficies de tuberías (hasta 1000 mm de diámetro) aisladas para Conservación de Calor"]
[]
[null,null,null,"Valor promedio de Perdidas Instalación actual en W/m²"]
[]
{"$rows_left_out":116}
{"sheet":"Datos (PPI AISLAMIENTO)","index":3,"n_rows":46,"n_cols":22,"rows_kept":46,"cut":false,"hidden":false,"merged":[]}
[null,"ANEXO 3: Registro de Puntos de Inspección en Aislamiento "]
[]
[null,"A) Registro de Puntos de Inspección de tuberías aisladas"]
[]
[null,null,null,null,null,null,"TIPO  DE CONTROL"]
[null,"Columna1","PUNTOS DE INSPECCIÓN","CRITERIOS DE ACEPTACIÓN","PUNTO DE LA GUIA","MUESTRA INSTALACION","V","D","P","C","T","VALORACIÓN INSPECTOR","OBSERVACIONES INSPECTOR","Peso Parcial (%) de Punto de Inspección","Ponderación puntos (%)"]
[null,"Soporte del aislamiento","Colocación de los distanciadores, si procede (altura y separación)","Superficies horizontales: 950 mm ± 30 mm; Superficies Verticales: mínimo cada 3 metros. Según Guía","3.3.1 \n4.3.1",0.05,null,null,null,null,null,null,null,0.03,{"$f":"ROUND($L7*$N7,3)","v":0}]
[null,"Soporte del aislamiento","Rotura de puente térmico","Según Guía","3.3.1 \n4.3.1",0.05,null,null,null,null,null,null,null,0.03,{"$f":"ROUND($L8*$N8,3)","v":0},null,0.71890134518053506,0.80522932474640929,0.96295868900233872,0.98649170993241442]
{"$rows_left_out":39}
{"sheet":"CALIFICACIÓN","index":4,"n_rows":36,"n_cols":5,"rows_kept":36,"cut":false,"hidden":false,"merged":[]}
["CÁLCULO DE LA CALIFICACIÓN DE LA INSTALACIÓN"]
[]
["A) Superficies de tuberías (hasta 1000 mm de diámetro)"]
[]
["Tuberías","Nota BASE (N)","Ponderación Superficies Aisladas (% 1) ","Ponderación Calidad de aislamiento (% 2) ","Nota Total Obtenida \n(N x %1 x %2)"]
["ANEXO 2.a): Espesores de Aislamiento",6,{"$f":"'Datos (SUP AISLADA)'!H30","v":0},{"$f":"'Datos (ESP AISLAMIENTO)'!E60","v":0},{"$f":"ROUND($D6*$C6*$B6,2)","v":0}]
["ANEXO 3.a): Registros de Inspección",4,{"$f":"'Datos (SUP AISLADA)'!H30","v":0},{"$f":"'Datos (PPI AISLAMIENTO)'!O23","v":0},{"$f":"ROUND($D7*$C7*$B7,2)","v":0}]
["TOTAL NOTA MÁXIMA",{"$f":"SUM(Tabla30[Nota BASE (N)])","v":10},null,"TOTAL",{"$f":"SUM($E6:$E7)","v":0}]
{"$rows_left_out":29}
{"sheet":"COSTE NO AISLAM","index":5,"n_rows":45,"n_cols":6,"rows_kept":45,"cut":false,"hidden":false,"merged":[]}
["COSTE DE NO AISLAMIENTO"]
[]
["Precio adoptado energía kWh",null,null,null,null,"€/kWh"]
[]
["A) Superficies de tuberías (hasta 1000 mm de diámetro)"]
[]
["Número de horas anuales de trabajo bajo condiciones de operación",null,null,null,null,"horas/año"]
[]
{"$rows_left_out":38}
{"sheet":"Datos (GENERALES) (IMP)","index":6,"n_rows":111,"n_cols":11,"rows_kept":111,"cut":false,"hidden":true,"merged":[[1,1,2,7],[2,9,2,10],[1,9,1,10],[32,3,32,10],[6,1,6,2],[8,1,8,2],[10,1,10,2],[13,1,13,2],[15,1,15,2],[17,1,17,2],[21,1,21,2],[4,0,4,10],[19,0,19,10],[23,1,23,2],[25,1,25,2],[6,3,6,10],[8,3,8,10],[10,3,11,10],[13,3,13,5],[13,9,13,10],[53,1,58,10],[44,1,49,10],[25,3,26,10],[51,0,51,10],[34,0,34,10],[36,1,36,2],[21,3,21,5],[28,1,28,2],[30,1,30,2],[32,1,32,2],[42,0,42,10],[38,1,38,2],[69,7,69,9],[74,5,74,6],[75,5,75,6],[70,7,70,9],[71,7,71,9],[77,5,77,6],[78,5,78,6],[69,5,69,6],[70,5,70,6],[71,5,71,6],[72,5,72,6],[73,5,73,6],[15,3,15,5],[68,5,68,6],[38,3,38,10],[30,3,30,5],[28,3,28,5],[64,0,64,10],[68,7,68,9],[30,7,30,10],[23,7,23,10],[21,7,21,10],[36,3,36,6],[40,0,40,10],[17,3,17,10],[23,3,23,5],[28,9,28,10],[60,0,60,10],[102,2,103,6],[95,5,95,6],[92,5,92,6],[93,5,93,6],[72,7,72,9],[73,7,73,9],[74,7,74,9],[75,7,75,9],[86,7,86,9],[76,7,76,9],[77,7,77,9],[78,7,78,9],[85,7,85,9],[81,0,81,10],[98,0,98,10],[76,5,76,6],[88,5,88,6],[89,5,89,6],[95,7,95,9],[91,7,91,9],[91,5,91,6],[85,5,85,6],[86,5,86,6],[87,5,87,6],[110,7,110,10],[94,5,94,6],[92,7,92,9],[93,7,93,9],[94,7,94,9],[90,5,90,6],[87,7,87,9],[88,7,88,9],[89,7,89,9],[90,7,90,9],[107,2,107,6],[103,7,103,9],[107,7,107,9]]}
[]
[null,"HERRAMIENTA DE PREDIAGNÓSTICO DE ESTADO DE AISLAMIENTO DE SUPERFICIES CALIENTES EN INSTALACIONES INDUSTRIALES",null,null,null,null,null,null,null,"CÓDIGO DE INSPECCIÓN"]
[null,null,null,null,null,null,null,null,null,{"$f":"IF('Datos (GENERALES)'!B3=0,\" \",'Datos (GENERALES)'!B3)","v":" "}]
[]
["DATOS GENERALES"]
[]
[null,"PROPIEDAD DE LA INSTALACIÓN",null,{"$f":"IF('Datos (GENERALES)'!B7=0,\" \",'Datos (GENERALES)'!B7)","v":" "}]
[]
{"$rows_left_out":104}
{"sheet":"Datos (SUP AISLADA) (IMP)","index":7,"n_rows":32,"n_cols":14,"rows_kept":32,"cut":false,"hidden":true,"merged":[[0,0,0,13],[2,0,2,13],[14,0,14,13],[26,0,26,13]]}
["ANEXO 1: SUPERFICIE AISLADA"]
[]
["A) Superficies de tuberías (hasta 1000 mm de diámetro)"]
[]
[null,"Tª superficial de la instalación\n(ºC)","Total m² tubería","Total m² aislados para Conservación de Calor\n(CC)","Total m² aislados para Protección Personal\n(PP)",null,"% de superficie aislada para Conservación de Calor\n(CC)","% de superficie aislada para protección personal (PP)","% de superficie aislada (CC+PP)","% de superficie sin aislamiento",null,"Temperatura media de cada tramo (ºC)","TI\nTemperatura Incremental media para cálculo de CISA\nT(ºC)-60ºC","CISA60 (m²xTI)/1000"]
[null,"60<X≤100",{"$f":"IF('Datos (SUP AISLADA)'!B6=0,\" \",'Datos (SUP AISLADA)'!B6)","v":" "},{"$f":"IF('Datos (SUP AISLADA)'!C6=0,\" \",'Datos (SUP AISLADA)'!C6)","v":" "},{"$f":"IF('Datos (SUP AISLADA)'!D6=0,\" \",'Datos (SUP AISLADA)'!D6)","v":" "},null,{"$f":"IF('Datos (SUP AISLADA)'!F6=0,\" \",'Datos (SUP AISLADA)'!F6)","v":" "},{"$f":"IF('Datos (SUP AISLADA)'!G6=0,\" \",'Datos (SUP AISLADA)'!G6)","v":" "},{"$f":"IF('Datos (SUP AISLADA)'!H6=0,\" \",'Datos (SUP AISLADA)'!H6)","v":" "},{"$f":"IF('Datos (SUP AISLADA)'!I6=0,\" \",'Datos (SUP AISLADA)'!I6)","v":" "},null,80,{"$f":"L6-60","v":20},{"$f":"IF('Datos (SUP AISLADA)'!M6=0,\" \",'Datos (SUP AISLADA)'!M6)","v":" "}]
[null,"100<X≤200",{"$f":"IF('Datos (SUP AISLADA)'!B7=0,\" \",'Datos (SUP AISLADA)'!B7)","v":" "},{"$f":"IF('Datos (SUP AISLADA)'!C7=0,\" \",'Datos (SUP AISLADA)'!C7)","v":" "},{"$f":"IF('Datos (SUP AISLADA)'!D7=0,\" \",'Datos (SUP AISLADA)'!D7)","v":" "},null,{"$f":"IF('Datos (SUP AISLADA)'!F7=0,\" \",'Datos (SUP AISLADA)'!F7)","v":" "},{"$f":"IF('Datos (SUP AISLADA)'!G7=0,\" \",'Datos (SUP AISLADA)'!G7)","v":" "},{"$f":"IF('Datos (SUP AISLADA)'!H7=0,\" \",'Datos (SUP AISLADA)'!H7)","v":" "},{"$f":"IF('Datos (SUP AISLADA)'!I7=0,\" \",'Datos (SUP AISLADA)'!I7)","v":" "},null,150,{"$f":"L7-60","v":90},{"$f":"IF('Datos (SUP AISLADA)'!M7=0,\" \",'Datos (SUP AISLADA)'!M7)","v":" "}]
[null,"200<X≤300",{"$f":"IF('Datos (SUP AISLADA)'!B8=0,\" \",'Datos (SUP AISLADA)'!B8)","v":" "},{"$f":"IF('Datos (SUP AISLADA)'!C8=0,\" \",'Datos (SUP AISLADA)'!C8)","v":" "},{"$f":"IF('Datos (SUP AISLADA)'!D8=0,\" \",'Datos (SUP AISLADA)'!D8)","v":" "},null,{"$f":"IF('Datos (SUP AISLADA)'!F8=0,\" \",'Datos (SUP AISLADA)'!F8)","v":" "},{"$f":"IF('Datos (SUP AISLADA)'!G8=0,\" \",'Datos (SUP AISLADA)'!G8)","v":" "},{"$f":"IF('Datos (SUP AISLADA)'!H8=0,\" \",'Datos (SUP AISLADA)'!H8)","v":" "},{"$f":"IF('Datos (SUP AISLADA)'!I8=0,\" \",'Datos (SUP AISLADA)'!I8)","v":" "},null,250,190,{"$f":"IF('Datos (SUP AISLADA)'!M8=0,\" \",'Datos (SUP AISLADA)'!M8)","v":" "}]
{"$rows_left_out":25}
{"sheet":"Datos (ESP AISLAMIENTO) (IMP)","index":8,"n_rows":169,"n_cols":5,"rows_kept":169,"cut":false,"hidden":true,"merged":[[51,1,51,3],[0,0,0,7],[2,0,2,7],[4,0,4,7],[6,1,6,3],[49,0,49,7],[163,0,163,7],[74,0,74,7],[89,0,89,7],[91,0,91,7],[93,1,93,3],[137,0,137,7],[139,1,139,3]]}
["ANEXO 2: ESPESORES DE AISLAMIENTO"]
[]
["A) Superficies de tuberías (hasta 1000 mm de diámetro)"]
[]
["A.1) Superficies de tuberías (hasta 1000 mm de diámetro) aisladas para Conservación de Calor"]
[]
[null,"Valor promedio de Perdidas Instalación actual en W/m²",null,null,{"$f":"IF('Datos (ESP AISLAMIENTO)'!E7=0,0,'Datos (ESP AISLAMIENTO)'!E7)","v":0}]
[]
{"$rows_left_out":162}
{"sheet":"Datos (PPI AISLAMIENTO) (IMP)","index":9,"n_rows":45,"n_cols":15,"rows_kept":45,"cut":false,"hidden":true,"merged":[[38,1,42,1],[44,2,44,11],[24,0,24,14],[26,12,27,12],[26,13,27,13],[26,14,27,14],[28,1,29,1],[30,1,33,1],[34,1,37,1],[16,1,20,1],[22,2,22,11],[26,1,27,1],[26,2,27,2],[26,3,27,3],[26,4,27,4],[26,5,27,5],[26,6,26,10],[26,11,27,11],[12,1,15,1],[0,0,0,14],[2,0,2,14],[4,1,5,1],[4,2,5,2],[4,3,5,3],[4,4,5,4],[4,5,5,5],[4,6,4,10],[4,11,5,11],[4,12,5,12],[4,13,5,13],[4,14,5,14],[6,1,7,1],[8,1,11,1]]}
["ANEXO 3: Registro de Puntos de Inspección en Aislamiento "]
[]
["A) Registro de Puntos de Inspección de tuberías aisladas"]
[]
[null,null,"PUNTOS DE INSPECCIÓN","CRITERIOS DE ACEPTACIÓN","PUNTO DE LA GUIA","MUESTRA INSTALACION","TIPO  DE CONTROL",null,null,null,null,"VALORACIÓN INSPECTOR","OBSERVACIONES INSPECTOR","Peso Parcial (%) de Punto de Inspección","Ponderación puntos (%)"]
[null,null,null,null,null,null,"V","D","P","C","T"]
[null,"Soporte del aislamiento","Colocación de los distanciadores, si procede (altura y separación)","Superficies horizontales: 950 mm ± 30 mm; Superficies Verticales: mínimo cada 3 metros. Según Guía","3.3.1 \n4.3.1",0.05,{"$f":"IF(Tabla28[[#This Row],[V]]<>\"X\",\" \",Tabla28[[#This Row],[V]])","v":" "},{"$f":"IF(Tabla28[[#This Row],[D]]<>\"X\",\" \",Tabla28[[#This Row],[D]])","v":" "},{"$f":"IF(Tabla28[[#This Row],[P]]<>\"X\",\" \",Tabla28[[#This Row],[P]])","v":" "},{"$f":"IF(Tabla28[[#This Row],[C]]<>\"X\",\" \",Tabla28[[#This Row],[Columna1]])","v":" "},{"$f":"IF(Tabla28[[#This Row],[T]]<>\"X\",\" \",Tabla28[[#This Row],[T]])","v":" "},{"$f":"IF(Tabla28[[#This Row],[VALORACIÓN INSPECTOR]]=\" \",\" \",Tabla28[[#This Row],[VALORACIÓN INSPECTOR]])","v":0},{"$f":"IF(Tabla28[[#This Row],[OBSERVACIONES INSPECTOR]]=0,\" \",Tabla28[[#This Row],[OBSERVACIONES INSPECTOR]])","v":" "},0.03,{"$f":"ROUND($L7*$N7,3)","v":0}]
[null,null,"Rotura de puente térmico","Según Guía","3.3.1 \n4.3.1\n",0.05,{"$f":"IF(Tabla28[[#This Row],[V]]<>\"X\",\" \",Tabla28[[#This Row],[V]])","v":" "},{"$f":"IF(Tabla28[[#This Row],[D]]<>\"X\",\" \",Tabla28[[#This Row],[D]])","v":" "},{"$f":"IF(Tabla28[[#This Row],[P]]<>\"X\",\" \",Tabla28[[#This Row],[P]])","v":" "},{"$f":"IF(Tabla28[[#This Row],[C]]<>\"X\",\" \",Tabla28[[#This Row],[Columna1]])","v":" "},{"$f":"IF(Tabla28[[#This Row],[T]]<>\"X\",\" \",Tabla28[[#This Row],[T]])","v":" "},{"$f":"IF(Tabla28[[#This Row],[VALORACIÓN INSPECTOR]]=\" \",\" \",Tabla28[[#This Row],[VALORACIÓN INSPECTOR]])","v":0},{"$f":"IF(Tabla28[[#This Row],[OBSERVACIONES INSPECTOR]]=0,\" \",Tabla28[[#This Row],[OBSERVACIONES INSPECTOR]])","v":" "},0.03,{"$f":"ROUND($L8*$N8,3)","v":0}]
{"$rows_left_out":38}
{"sheet":"CALIFICACIÓN (IMP)","index":10,"n_rows":34,"n_cols":6,"rows_kept":34,"cut":false,"hidden":true,"merged":[[30,3,30,5],[31,3,31,5],[32,3,32,5],[33,3,33,5],[29,3,29,5],[0,0,0,6],[2,0,2,6],[9,0,9,6],[16,0,16,6],[25,0,25,6]]}
["CÁLCULO DE LA CALIFICACIÓN DE LA INSTALACIÓN"]
[]
["A) Superficies de tuberías (hasta 1000 mm de diámetro)"]
[]
[null,"Tuberías","Nota BASE (N)","Ponderación Superficies Aisladas (% 1) ","Ponderación Calidad de aislamiento (% 2) ","Nota Total Obtenida \n(N x %1 x %2)"]
[null,"ANEXO 2.a): Espesores de Aislamiento",6,{"$f":"'Datos (SUP AISLADA)'!H30","v":0},{"$f":"'Datos (ESP AISLAMIENTO)'!E60","v":0},{"$f":"ROUND($E6*$D6*$C6,2)","v":0}]
[null,"ANEXO 3.a): Registros de Inspección",4,{"$f":"'Datos (SUP AISLADA)'!H30","v":0},{"$f":"'Datos (PPI AISLAMIENTO)'!O23","v":0},{"$f":"ROUND($E7*$D7*$C7,2)","v":0}]
[null,"TOTAL NOTA MÁXIMA",{"$f":"SUM(C6:C7)","v":10},null,"TOTAL",{"$f":"SUM($F6:$F7)","v":0}]
{"$rows_left_out":27}
{"sheet":"COSTE NO AISLAM (IMP)","index":11,"n_rows":43,"n_cols":8,"rows_kept":43,"cut":false,"hidden":true,"merged":[[9,5,9,6],[0,0,0,8],[2,1,2,5],[4,0,4,8],[6,1,6,5],[8,5,8,6],[23,3,23,4],[23,5,23,6],[10,5,10,6],[11,5,11,6],[12,5,12,6],[13,5,13,6],[14,5,14,6],[15,5,15,6],[16,5,16,6],[18,0,18,8],[20,1,20,5],[22,3,22,4],[22,5,22,6],[24,3,24,4],[24,5,24,6],[25,3,25,4],[25,5,25,6],[26,3,26,4],[26,5,26,6],[37,3,37,4],[27,3,27,4],[27,5,27,6],[28,3,28,4],[28,5,28,6],[29,3,29,4],[29,5,29,6],[30,5,30,6],[32,0,32,8],[34,3,34,4],[35,3,35,4],[36,3,36,4],[38,3,38,4],[39,3,39,4],[40,3,40,4],[41,3,41,4],[42,3,42,4]]}
["COSTE DE NO AISLAMIENTO"]
[]
[null,"Precio adoptado energía kWh",null,null,null,null,{"$f":"IF('COSTE NO AISLAM'!E3=0,\" \",'COSTE NO AISLAM'!E3)","v":" "},"€/kWh"]
[]
["A) Superficies de tuberías (hasta 1000 mm de diámetro)"]
[]
[null,"Número de horas anuales de trabajo bajo condiciones de operación",null,null,null,null,{"$f":"IF('COSTE NO AISLAM'!E7=0,\" \",'COSTE NO AISLAM'!E7)","v":" "},"horas/año"]
[]
{"$rows_left_out":36}
{"sheet":"RECOMENDACIONES (IMP)","index":12,"n_rows":15,"n_cols":2,"rows_kept":15,"cut":false,"hidden":true,"merged":[[12,1,12,5],[13,1,13,5],[14,1,17,5],[0,0,0,5],[2,0,2,5],[4,1,4,5],[5,1,5,5],[6,1,8,5],[10,0,10,5]]}
["RECOMENDACIONES DEL INSPECTOR"]
[]
["A) Superficies de tuberías (hasta 1000 mm de diámetro)"]
[]
[null,{"$f":"IF('Datos (SUP AISLADA)'!$M$13<=0,\"\",\"La nota parcial obtenida para las tuberías de la instalación ha sido: \"&(IF(CALIFICACIÓN!$E$8<='Hoja de programación'!$R$6,'Hoja de programación'!$S$6,(IF(CALIFICACIÓN!$E$8<='Hoja de programación'!$R$5,'Hoja de programación'!$S$5,(IF(CALIFICACIÓN!$E$8<='Hoja de programación'!$R$4,'Hoja de programación'!$S$4,(IF(CALIFICACIÓN!$E$8<='Hoja de programación'!$R$3,'Hoja de programación'!$S$3,0)))))))))","v":""}]
[null,{"$f":"IF('Datos (SUP AISLADA)'!$M$13<=0,\" \",\"Las medidas a adoptar atendiendo a la calificación obtenida son:\")","v":" "}]
[null,{"$f":"IF('Datos (SUP AISLADA)'!$M$13<=0,\" \",VLOOKUP((IF(CALIFICACIÓN!$E$8<='Hoja de programación'!$R$6,'Hoja de programación'!$S$6,(IF(CALIFICACIÓN!$E$8<='Hoja de programación'!$R$5,'Hoja de programación'!$S$5,(IF(CALIFICACIÓN!$E$8<='Hoja de programación'!$R$4,'Hoja de programación'!$S$4,(IF(CALIFICACIÓN!$E$8<='Hoja de programación'!$R$3,'Hoja de programación'!$S$3,0)))))))),'Hoja de programación'!$G$9:$H$13,2,FALSE))","v":" "}]
[]
{"$rows_left_out":8}
{"sheet":"Hoja de programación","index":13,"n_rows":54,"n_cols":21,"rows_kept":54,"cut":false,"hidden":true,"merged":[]}
["Datos validación",null,"Percentiles",null,"Cumplimiento",null,null,null,null,"Checklist",null,"Provincias","Comunidad Autónoma","CC_XX"]
["Sí",null,0,null,"Sí",null,"Nota","Recomendaciones",null,null,null,null,null,null,null,null,"Inferior","Superior","Nota"]
["No",null,0.1,null,"Parcial",null,"Excelente","Mantenimiento Preventivo",null,"X",null,"Albacete","CASTILLA LA MANCHA","02",null,null,9,10,"Excelente"]
[null,null,0.2,null,"No",null,"Muy bueno","Mantenimiento Preventivo. Actuaciones puntuales",null,null,null,"Alicante/Alacant","COMUNIDAD VALENCIANA","03",null,null,7,9,"Muy bueno"]
[null,null,0.3,null,null,null,"Correcto","Manteamiento Correctivo y Preventivo. Actuaciones de mejora",null,null,null,"Almería","ANDALUCÍA","04",null,null,5,7,"Correcto"]
[null,null,0.4,null,null,null,"Deficiente","Actuaciones generalizadas de mejora",null,null,null,"Araba/Álava","EUSKADI","01",null,null,0,5,"Deficiente",null,{"$f":"(IF(CALIFICACIÓN!$E$8<='Hoja de programación'!$R$6,'Hoja de programación'!$S$6,(IF(CALIFICACIÓN!$E$8<='Hoja de programación'!$R$5,'Hoja de programación'!$S$5,(IF(CALIFICACIÓN!$E$8<='Hoja de programación'!$R$4,'Hoja de programación'!$S$4,(IF(CALIFICACIÓN!$E$8<='Hoja de programación'!$R$3,'Hoja de programación'!$S$3,0))))))))","v":"Deficiente"}]
[null,null,0.5,null,null,null,null,null,null,null,null,"Asturias","PRINCIPADO DE ASTURIAS","33",null,null,null,null,null,null,{"$f":"IF(CALIFICACIÓN!$E$15<='Hoja de programación'!$R$6,'Hoja de programación'!$S$6,(IF(CALIFICACIÓN!$E$15<='Hoja de programación'!$R$5,'Hoja de programación'!$S$5,(IF(CALIFICACIÓN!$E$15<='Hoja de programación'!$R$4,'Hoja de programación'!$S$4,(IF(CALIFICACIÓN!$E$15<='Hoja de programación'!$R$3,'Hoja de programación'!$S$3,0)))))))","v":"Deficiente"}]
[null,null,0.6,null,null,null,"Nota","Recomendación Tuberías",null,null,null,"Ávila","CASTILLA-LEÓN","05"]
{"$rows_left_out":47}
{"sheet":"Hoja Cálculos Térmicos","index":14,"n_rows":31,"n_cols":17,"rows_kept":31,"cut":false,"hidden":true,"merged":[]}
[]
[null,"Temperatura ambiental en ºC",null,null,{"$f":"IFERROR((MIN('Datos (GENERALES) (IMP)'!H104:J104,'Datos (GENERALES) (IMP)'!H108:J108)),25)","v":0},"ºC"]
[]
[null,"A) Superficies de tuberías (hasta 1000 mm de diámetro)"]
[]
[]
[null,null,"Tª superficial de la instalación\n(ºC)","Tª superficial media por tramo\n(ºC)","Tª superficial media por tramo\n(K)","Tª ambiental por tramo\n(ºC)","Tª ambiental por tramo\n(K)","Diametro promedio en mm","Diametro promedio en m","Superficie exterior tubería en m2","h convección","h radiación","h total= h convección + h radicación","R conv_cilindrica","Pérdidas W/metro lineal","Pérdidas W/ m2","Pérdidas kW/ m2"]
[null,null,"60<X≤100",80,{"$f":"D8+273","v":353},{"$f":"$E$2","v":0},{"$f":"F8+273","v":273},{"$f":"'COSTE NO AISLAM'!C10","v":0},{"$f":"H8/1000","v":0},{"$f":"PI()*I8","v":0},{"$f":"IFERROR(IF(I8^3*(D8-F8)<=10,SQRT(SQRT((D8-F8)/I8))*1.25,1.21*((D8-F8)^(1/3))),0)","v":0},{"$f":"0.9*0.0000000567*(E8+G8)*(E8*E8+G8*G8)","v":6.3614195996399996},{"$f":"K8+L8","v":6.3614195996399996},{"$f":"IFERROR((1/(PI()*I8*M8)),0)","v":0},{"$f":"IFERROR(((D8-F8)/N8),0)","v":0},{"$f":"IFERROR((O8/J8),0)","v":0},{"$f":"P8/1000","v":0}]
{"$rows_left_out":23}